person
type: Class
comment: a foaf subclass of wordnet person
subclass of: Person

document
type: Class
comment: a foaf subclass of wordnet document
subclass of: Document

organization
type: Class
comment: a foaf subclass of wordnet organization
subclass of: Organization

project
type: Class
comment: a foaf subclass of wordnet project
subclass of: Project

Personal Mailbox
type: Property
comment: A web-identifiable Internet mailbox associated with exactly one owner. This property is a 'unique property' in the DAML+OIL sense, in that there is at most one individual that has any particular personal mailbox.
domain: person
range: Resource
type: UnambiguousProperty

Given name
type: Property
comment: The given name of some agent.

Surname
type: Property
comment: The surname of some agent.
domain: person
range: Literal

Title
type: Property
comment: Title (Mr, Mrs, Ms, Dr. etc)

Phone number
type: Property
comment: A fully qualified international phone number, specified using the tel: URL scheme (refs: http://www.w3.org/Addressing/schemes.html#tel)

Nickname
type: Property
comment: A short informal nickname characterising an agent (includes login identifiers, IRC and other chat nicknames).

name
type: Property
comment: A name for a resource
range: Literal

firstName
type: Property
comment: the first name of a person
domain: person
range: Literal

homepage
type: Property
comment: A homepage of the resource
range: Resource

image
type: Property
comment: a link to an image of the person
domain: person
range: Resource

depiction
type: Property
comment: a link to a depiction of the person
domain: person
range: Resource

workplaceHomepage
type: Property
comment: a link to workplace homepage of the person
domain: person
range: Resource

workOrgHomepage
type: Property
comment: a link to work organisation homepage of the person - maybe synonymous with workplaceHomepage?
domain: person
range: Resource

schoolHomepage
type: Property
comment: a homepage of a school attended by the person
domain: person
range: Resource

knows
type: Property
comment: a link to people who this person knows
domain: person
range: person

interest
type: Property
comment: an interest of this person
domain: person
range: Resource

publications
type: Property
comment: a link to the publications of this person
domain: person
range: Resource

project
type: Property
comment: a project a person works on
domain: person
range: Resource

past project
type: Property
comment: a project a person has previously worked on
domain: person
range: Resource

funded by
type: Property
comment: an organisation funding a project or person
domain: Resource
range: Resource

linked with
type: Property
comment: generic link
domain: Resource
range: Resource

logo
type: Property
comment: a logo url
domain: Resource
range: Resource